Target
Ectonucleotide pyrophosphatase/phosphodiesterase family member 2
Ligand
BDBM50322705
Substrate
Meas. Tech.
ChEMBL_642245 (CHEMBL1176954)
IC50
111±n/a nM
Citation
 Albers, HMvan Meeteren, LAEgan, DAvan Tilburg, EWMoolenaar, WHOvaa, H Discovery and optimization of boronic acid based inhibitors of autotaxin. J Med Chem 53:4958-67 (2010)  
Target
Name:
Ectonucleotide pyrophosphatase/phosphodiesterase family member 2
Synonyms:
ATX Autotaxin (ATX) ENPP2 Ectonucleotide Pyrophosphatase/Phosphodiesterase 2 (ENPP2) Extracellular lysophospholipase D PDNP2
Type:
Enzyme
Mol. Mass.:
99007.13
Organism:
Homo sapiens (Human)
Description:
Q13822
Residue:
863
  
Inhibitor
Name:
BDBM50322705
Synonyms:
3-benzyl-5-((1,3-dimethyl-2-oxo-2,3-dihydro-1H-benzo[d]imidazol-5-yl)methylene)thiazolidine-2,4-dione | CHEMBL1173301
Type:
Small organic molecule
Emp. Form.:
C20H17N3O3S
Mol. Mass.:
379.432
SMILES:
Cn1c2ccc(\C=C3/SC(=O)N(Cc4ccccc4)C3=O)cc2n(C)c1=O
: