Target
Adenosine receptor A2b
Ligand
BDBM50188569
Substrate
Meas. Tech.
ChEMBL_644535 (CHEMBL1211412)
Ki
22±n/a nM
Citation
 Cheng, FXu, ZLiu, GTang, Y Insights into binding modes of adenosine A(2B) antagonists with ligand-based and receptor-based methods. Eur J Med Chem 45:3459-71 (2010)  
Target
Name:
Adenosine receptor A2b
Synonyms:
AA2BR_HUMAN ADORA2B Adenosine receptors A2b | Adenosine receptors; A2a & A2b
Type:
G Protein-Coupled Receptor (GPCR)
Mol. Mass.:
36341.22
Organism:
Homo sapiens (Human)
Description:
Residue:
332
  
Inhibitor
Name:
BDBM50188569
Synonyms:
8-(1-(2-chloro-5-(trifluoromethyl)benzyl)-1H-pyrazol-4-yl)-1,3-dipropyl-1H-purine-2,6(3H,7H)-dione | CHEMBL378598
Type:
Small organic molecule
Emp. Form.:
C22H22ClF3N6O2
Mol. Mass.:
494.897
SMILES:
CCCn1c2nc([nH]c2c(=O)n(CCC)c1=O)-c1cnn(Cc2cc(ccc2Cl)C(F)(F)F)c1
: