Target
Somatostatin receptor type 5
Ligand
BDBM50322981
Substrate
Meas. Tech.
ChEMBL_643481 (CHEMBL1212345)
EC50
>1000±n/a nM
Citation
 Alker, ABinggeli, AChrist, ADGreen, LMaerki, HPMartin, REMohr, P Piperidinyl-nicotinamides as potent and selective somatostatin receptor subtype 5 antagonists. Bioorg Med Chem Lett 20:4521-5 (2010)  
Target
Name:
Somatostatin receptor type 5
Synonyms:
SOMATOSTATIN SST5 SS5-R SSR5_HUMAN Somatostatin receptor type 5 (SSTR5)
Type:
Enzyme
Mol. Mass.:
39218.02
Organism:
Homo sapiens (Human)
Description:
P35346
Residue:
364
  
Inhibitor
Name:
BDBM50322981
Synonyms:
CHEMBL1210207 | N-(1-((2,6-diethoxy-4'-fluorobiphenyl-4-yl)methyl)piperidin-4-yl)-5-methylnicotinamide
Type:
Small organic molecule
Emp. Form.:
C29H34FN3O3
Mol. Mass.:
491.597
SMILES:
CCOc1cc(CN2CCC(CC2)NC(=O)c2cncc(C)c2)cc(OCC)c1-c1ccc(F)cc1
: