Target
Procathepsin L
Ligand
BDBM50313467
Substrate
Meas. Tech.
ChEMBL_643704 (CHEMBL1212568)
IC50
>10000±n/a nM
Citation
 Cai, JBennett, DJRankovic, ZDempster, MFradera, XGillespie, JCumming, IFinlay, WBaugh, MBoucharens, SBruin, JCameron, KSHamilton, WKerr, JKinghorn, EMcGarry, GRobinson, JScullion, PUitdehaag, JCvan Zeeland, MPotin, DSaniere, LFouquet, AChevallier, FDeronzier, HDorleans, CNicolai, E 2-Phenyl-9H-purine-6-carbonitrile derivatives as selective cathepsin S inhibitors. Bioorg Med Chem Lett 20:4447-50 (2010)  
Target
Name:
Procathepsin L
Synonyms:
CATL1_HUMAN CTSL CTSL1 Cathepsin L Cathepsin L1 heavy chain MEP cathepsin L preproprotein
Type:
Enzyme
Mol. Mass.:
37557.19
Organism:
Homo sapiens (Human)
Description:
Purchased from Calbiochem (San Diego, CA).
Residue:
333
  
Inhibitor
Name:
BDBM50313467
Synonyms:
4-(3-tert-butylphenyl)-6-propylpyrimidine-2-carbonitrile | CHEMBL1077193
Type:
Small organic molecule
Emp. Form.:
C18H21N3
Mol. Mass.:
279.3794
SMILES:
CCCc1cc(nc(n1)C#N)-c1cccc(c1)C(C)(C)C
: