Target
Cathepsin S
Ligand
BDBM50323081
Substrate
Meas. Tech.
ChEMBL_643701 (CHEMBL1212565)
IC50
63±n/a nM
Citation
 Cai, JBennett, DJRankovic, ZDempster, MFradera, XGillespie, JCumming, IFinlay, WBaugh, MBoucharens, SBruin, JCameron, KSHamilton, WKerr, JKinghorn, EMcGarry, GRobinson, JScullion, PUitdehaag, JCvan Zeeland, MPotin, DSaniere, LFouquet, AChevallier, FDeronzier, HDorleans, CNicolai, E 2-Phenyl-9H-purine-6-carbonitrile derivatives as selective cathepsin S inhibitors. Bioorg Med Chem Lett 20:4447-50 (2010)  
Target
Name:
Cathepsin S
Synonyms:
CATS_HUMAN Cathepsin S (Cat S) | cathepsin S preproprotein
Type:
Protein
Mol. Mass.:
37507.38
Organism:
Homo sapiens (Human)
Description:
P25774
Residue:
331
  
Inhibitor
Name:
BDBM50323081
Synonyms:
4-(3-cyclobutylphenyl)-6-propylpyrimidine-2-carbonitrile | CHEMBL1209374
Type:
Small organic molecule
Emp. Form.:
C18H19N3
Mol. Mass.:
277.3636
SMILES:
CCCc1cc(nc(n1)C#N)-c1cccc(c1)C1CCC1
: