Target
Cathepsin B
Ligand
BDBM50313461
Substrate
Meas. Tech.
ChEMBL_643703 (CHEMBL1212567)
IC50
>10000±n/a nM
Citation
 Cai, JBennett, DJRankovic, ZDempster, MFradera, XGillespie, JCumming, IFinlay, WBaugh, MBoucharens, SBruin, JCameron, KSHamilton, WKerr, JKinghorn, EMcGarry, GRobinson, JScullion, PUitdehaag, JCvan Zeeland, MPotin, DSaniere, LFouquet, AChevallier, FDeronzier, HDorleans, CNicolai, E 2-Phenyl-9H-purine-6-carbonitrile derivatives as selective cathepsin S inhibitors. Bioorg Med Chem Lett 20:4447-50 (2010)  
Target
Name:
Cathepsin B
Synonyms:
APP secretase CATB_HUMAN CTSB Cathepsin B light chain | Cathepsin B1
Type:
Enzyme
Mol. Mass.:
37819.69
Organism:
Homo sapiens (Human)
Description:
gi_63102437
Residue:
339
  
Inhibitor
Name:
BDBM50313461
Synonyms:
4-propyl-6-(3-(trifluoromethyl)phenyl)pyrimidine-2-carbonitrile | CHEMBL1079000
Type:
Small organic molecule
Emp. Form.:
C15H12F3N3
Mol. Mass.:
291.2711
SMILES:
CCCc1cc(nc(n1)C#N)-c1cccc(c1)C(F)(F)F
: