Target
Serine/threonine-protein kinase PLK1
Ligand
BDBM50323118
Substrate
Meas. Tech.
ChEMBL_643706 (CHEMBL1212570)
IC50
6±n/a nM
Citation
 Rheault, TRDonaldson, KHBadiang-Alberti, JGDavis-Ward, RGAndrews, CWBambal, RJackson, JRCheung, M Heteroaryl-linked 5-(1H-benzimidazol-1-yl)-2-thiophenecarboxamides: potent inhibitors of polo-like kinase 1 (PLK1) with improved drug-like properties. Bioorg Med Chem Lett 20:4587-92 (2010)  
Target
Name:
Serine/threonine-protein kinase PLK1
Synonyms:
PLK PLK1 Polo-like kinase 1 (PlK1) STPK13 Serine/threonine-protein kinase 13 | polo-like kinase
Type:
Serine/threonine-protein kinase
Mol. Mass.:
68277.16
Organism:
Homo sapiens (Human)
Description:
P53350
Residue:
603
  
Inhibitor
Name:
BDBM50323118
Synonyms:
(R)-5-(5-(pyridin-2-yl)-1H-benzo[d]imidazol-1-yl)-3-(1-(2-(trifluoromethyl)phenyl)ethoxy)thiophene-2-carboxamide | CHEMBL1209756
Type:
Small organic molecule
Emp. Form.:
C26H19F3N4O2S
Mol. Mass.:
508.515
SMILES:
C[C@@H](Oc1cc(sc1C(N)=O)-n1cnc2cc(ccc12)-c1ccccn1)c1ccccc1C(F)(F)F
: