Target
Dipeptidyl peptidase 4
Ligand
BDBM50323173
Substrate
Meas. Tech.
ChEMBL_643842 (CHEMBL1211741)
Ki
50±n/a nM
Citation
 Brigance, RPMeng, WFura, AHarrity, TWang, AZahler, RKirby, MSHamann, LG Synthesis and SAR of azolopyrimidines as potent and selective dipeptidyl peptidase-4 (DPP4) inhibitors for type 2 diabetes. Bioorg Med Chem Lett 20:4395-8 (2010)  
Target
Name:
Dipeptidyl peptidase 4
Synonyms:
ADABP Adenosine deaminase complexing protein 2 CD_antigen=CD26 DPP4 DPPIV Dipeptidyl peptidase 4 (DPP IV) Dipeptidyl peptidase 4 (DPP4) Dipeptidyl peptidase 4 membrane form Dipeptidyl peptidase IV Dipeptidyl peptidase IV (DDP-IV) Dipeptidyl peptidase IV membrane form Dipeptidyl peptidase-IV (DPP-4) T-cell activation antigen CD26 | TP103
Type:
Enzyme
Mol. Mass.:
88271.01
Organism:
Homo sapiens (Human)
Description:
P27487
Residue:
766
  
Inhibitor
Name:
BDBM50323173
Synonyms:
(7-(2,4-dichlorophenyl)-5-methyl-2-o-tolylpyrazolo[1,5-a]pyrimidin-6-yl)methanamine | CHEMBL1209540
Type:
Small organic molecule
Emp. Form.:
C21H18Cl2N4
Mol. Mass.:
397.3
SMILES:
Cc1ccccc1-c1cc2nc(C)c(CN)c(-c3ccc(Cl)cc3Cl)n2n1
: