Target
Cathepsin S
Ligand
BDBM50323247
Substrate
Meas. Tech.
ChEMBL_643894 (CHEMBL1211793)
IC50
2.6±n/a nM
Citation
 Cai, JBaugh, MBlack, DLong, CJonathan Bennett, DDempster, MFradera, XGillespie, JAndrews, FBoucharens, SBruin, JCameron, KSCumming, IHamilton, WJones, PSKaptein, AKinghorn, EMaidment, MMartin, IMitchell, ARankovic, ZRobinson, JScullion, PUitdehaag, JCVink, PWestwood, Pvan Zeeland, Mvan Berkom, LBastiani, MMeulemans, T 6-Phenyl-1H-imidazo[4,5-c]pyridine-4-carbonitrile as cathepsin S inhibitors. Bioorg Med Chem Lett 20:4350-4 (2010)  
Target
Name:
Cathepsin S
Synonyms:
CATS_MOUSE Ctss
Type:
Enzyme
Mol. Mass.:
38476.67
Organism:
Mus musculus (Mouse)
Description:
O70370
Residue:
340
  
Inhibitor
Name:
BDBM50323247
Synonyms:
6-(4-(3-(dimethylamino)propoxy)-3-(trifluoromethyl)phenyl)-1-methyl-1H-imidazo[4,5-c]pyridine-4-carbonitrile US9115126, Reference imidazopyridine derivative from WO 2009/010491 - Example 2a
Type:
Small organic molecule
Emp. Form.:
C20H20F3N5O
Mol. Mass.:
403.4009
SMILES:
CN(C)CCCOc1ccc(cc1C(F)(F)F)-c1cc2n(C)cnc2c(n1)C#N
: