Target
Cathepsin K
Ligand
BDBM50323266
Substrate
Meas. Tech.
ChEMBL_643890 (CHEMBL1211789)
IC50
>10000±n/a nM
Citation
 Cai, JBaugh, MBlack, DLong, CJonathan Bennett, DDempster, MFradera, XGillespie, JAndrews, FBoucharens, SBruin, JCameron, KSCumming, IHamilton, WJones, PSKaptein, AKinghorn, EMaidment, MMartin, IMitchell, ARankovic, ZRobinson, JScullion, PUitdehaag, JCVink, PWestwood, Pvan Zeeland, Mvan Berkom, LBastiani, MMeulemans, T 6-Phenyl-1H-imidazo[4,5-c]pyridine-4-carbonitrile as cathepsin S inhibitors. Bioorg Med Chem Lett 20:4350-4 (2010)  
Target
Name:
Cathepsin K
Synonyms:
CATK_HUMAN CTSO Cathepsin O Cathepsin X
Type:
Enzyme
Mol. Mass.:
36975.68
Organism:
Homo sapiens (Human)
Description:
P43235
Residue:
329
  
Inhibitor
Name:
BDBM50323266
Synonyms:
6-(4-(ethylamino)-3-(trifluoromethyl)phenyl)-1H-imidazo[4,5-c]pyridine-4-carbonitrile | CHEMBL1208846
Type:
Small organic molecule
Emp. Form.:
C16H12F3N5
Mol. Mass.:
331.2952
SMILES:
CCNc1ccc(cc1C(F)(F)F)-c1cc2[nH]cnc2c(n1)C#N
: