Target
Cathepsin S
Ligand
BDBM50323257
Substrate
Meas. Tech.
ChEMBL_643889 (CHEMBL1211788)
IC50
20±n/a nM
Citation
 Cai, JBaugh, MBlack, DLong, CJonathan Bennett, DDempster, MFradera, XGillespie, JAndrews, FBoucharens, SBruin, JCameron, KSCumming, IHamilton, WJones, PSKaptein, AKinghorn, EMaidment, MMartin, IMitchell, ARankovic, ZRobinson, JScullion, PUitdehaag, JCVink, PWestwood, Pvan Zeeland, Mvan Berkom, LBastiani, MMeulemans, T 6-Phenyl-1H-imidazo[4,5-c]pyridine-4-carbonitrile as cathepsin S inhibitors. Bioorg Med Chem Lett 20:4350-4 (2010)  
Target
Name:
Cathepsin S
Synonyms:
CATS_HUMAN Cathepsin S (Cat S) | cathepsin S preproprotein
Type:
Protein
Mol. Mass.:
37507.38
Organism:
Homo sapiens (Human)
Description:
P25774
Residue:
331
  
Inhibitor
Name:
BDBM50323257
Synonyms:
1-methyl-6-(4-(pyridin-2-ylmethoxy)-3-(trifluoromethyl)phenyl)-1H-imidazo[4,5-c]pyridine-4-carbonitrile | CHEMBL1208975
Type:
Small organic molecule
Emp. Form.:
C21H14F3N5O
Mol. Mass.:
409.364
SMILES:
Cn1cnc2c(nc(cc12)-c1ccc(OCc2ccccn2)c(c1)C(F)(F)F)C#N
: