Target
Cathepsin S
Ligand
BDBM50323258
Substrate
Meas. Tech.
ChEMBL_643889 (CHEMBL1211788)
IC50
24±n/a nM
Citation
 Cai, JBaugh, MBlack, DLong, CJonathan Bennett, DDempster, MFradera, XGillespie, JAndrews, FBoucharens, SBruin, JCameron, KSCumming, IHamilton, WJones, PSKaptein, AKinghorn, EMaidment, MMartin, IMitchell, ARankovic, ZRobinson, JScullion, PUitdehaag, JCVink, PWestwood, Pvan Zeeland, Mvan Berkom, LBastiani, MMeulemans, T 6-Phenyl-1H-imidazo[4,5-c]pyridine-4-carbonitrile as cathepsin S inhibitors. Bioorg Med Chem Lett 20:4350-4 (2010)  
Target
Name:
Cathepsin S
Synonyms:
CATS_HUMAN Cathepsin S (Cat S) | cathepsin S preproprotein
Type:
Protein
Mol. Mass.:
37507.38
Organism:
Homo sapiens (Human)
Description:
P25774
Residue:
331
  
Inhibitor
Name:
BDBM50323258
Synonyms:
6-(4-(3-hydroxypropyl)-3-(trifluoromethyl)phenyl)-1-methyl-1H-imidazo[4,5-c]pyridine-4-carbonitrile US9115126, WO 2009/010491, Example 15
Type:
Small organic molecule
Emp. Form.:
C18H15F3N4O
Mol. Mass.:
360.3331
SMILES:
Cn1cnc2c(nc(cc12)-c1ccc(CCCO)c(c1)C(F)(F)F)C#N
: