Target
Cathepsin S
Ligand
BDBM50323244
Substrate
Meas. Tech.
ChEMBL_643889 (CHEMBL1211788)
IC50
63±n/a nM
Citation
 Cai, JBaugh, MBlack, DLong, CJonathan Bennett, DDempster, MFradera, XGillespie, JAndrews, FBoucharens, SBruin, JCameron, KSCumming, IHamilton, WJones, PSKaptein, AKinghorn, EMaidment, MMartin, IMitchell, ARankovic, ZRobinson, JScullion, PUitdehaag, JCVink, PWestwood, Pvan Zeeland, Mvan Berkom, LBastiani, MMeulemans, T 6-Phenyl-1H-imidazo[4,5-c]pyridine-4-carbonitrile as cathepsin S inhibitors. Bioorg Med Chem Lett 20:4350-4 (2010)  
Target
Name:
Cathepsin S
Synonyms:
CATS_HUMAN Cathepsin S (Cat S) | cathepsin S preproprotein
Type:
Protein
Mol. Mass.:
37507.38
Organism:
Homo sapiens (Human)
Description:
P25774
Residue:
331
  
Inhibitor
Name:
BDBM50323244
Synonyms:
6-(4-(3-(4-ethylpiperazin-1-yl)propoxy)-3-(trifluoromethyl)phenyl)-1-methyl-1H-imidazo[4,5-c]pyridine-4-carbonitrile | CHEMBL1209145
Type:
Small organic molecule
Emp. Form.:
C24H27F3N6O
Mol. Mass.:
472.506
SMILES:
CCN1CCN(CCCOc2ccc(cc2C(F)(F)F)-c2cc3n(C)cnc3c(n2)C#N)CC1
: