Target
Protein phosphatase 3 catalytic subunit alpha
Ligand
BDBM50323714
Substrate
Meas. Tech.
ChEMBL_647729 (CHEMBL1220326)
IC50
16400±n/a nM
Citation
 Zhang, YErdmann, FFischer, G Augmented photoswitching modulates immune signaling. Nat Chem Biol 5:724-6 (2009)  
Target
Name:
Protein phosphatase 3 catalytic subunit alpha
Synonyms:
CALNA PP2BA_HUMAN Serine/threonine protein phosphatase 2B catalytic subunit, alpha isoform calcineurin
Type:
Enzyme Catalytic Domain
Mol. Mass.:
58681.14
Organism:
Homo sapiens (Human)
Description:
calcineurin 0 HUMAN::Q08209
Residue:
521
  
Inhibitor
Name:
BDBM50323714
Synonyms:
CHEMBL1213206 N-(4-((Z)-(4-(2-(((2R,5S,8S,11S,14S,17S,23S,26S,29S,32S)-17-ethyl-14-((1R,2R,E)-1-hydroxy-2-methylhex-4-enyl)-5,8,23,29-tetraisobutyl-11,26-diisopropyl-4,7,10,13,19,22,28,32-octamethyl-3,6,9,12,15,18,21,24,27,30,33-undecaoxo-1,4,7,10,13,16,19,22,25,28,31-undecaazacyclotritriacontan-2-yl)methoxy)acetamido)phenyl)diazenyl)phenyl)-5-((3aS,4S,6aR)-2-oxohexahydro-1H-thieno[3,4-d]imidazol-4-yl)pentanamide
Type:
Small organic molecule
Emp. Form.:
C86H137N17O16S
Mol. Mass.:
1697.177
SMILES:
CC[C@@H]1NC(=O)[C@H]([C@H](O)[C@H](C)C\C=C\C)N(C)C(=O)[C@H](C(C)C)N(C)C(=O)[C@H](CC(C)C)N(C)C(=O)[C@H](CC(C)C)N(C)C(=O)[C@@H](COCC(=O)Nc2ccc(cc2)N=Nc2ccc(NC(=O)CCCC[C@@H]3SC[C@@H]4NC(=O)N[C@H]34)cc2)NC(=O)[C@H](C)NC(=O)[C@H](CC(C)C)N(C)C(=O)[C@@H](NC(=O)[C@H](CC(C)C)N(C)C(=O)CN(C)C1=O)C(C)C
: