Target
Carbonic anhydrase 15
Ligand
BDBM79403
Substrate
Meas. Tech.
ChEMBL_646965 (CHEMBL1217106)
Ki
74000±n/a nM
Citation
 Carta, FTemperini, CInnocenti, AScozzafava, AKaila, KSupuran, CT Polyamines inhibit carbonic anhydrases by anchoring to the zinc-coordinated water molecule. J Med Chem 53:5511-22 (2010)  
Target
Name:
Carbonic anhydrase 15
Synonyms:
CAH15_MOUSE Car15
Type:
PROTEIN
Mol. Mass.:
35484.02
Organism:
Mus musculus
Description:
ChEMBL_651955
Residue:
324
  
Inhibitor
Name:
BDBM79403
Synonyms:
3-aminopropyl-[4-(3-aminopropylamino)butyl]amine;hydrochloride MLS002472980 N,N''-bis(3-azanylpropyl)butane-1,4-diamine;hydrochloride SMR001397086 cid_5351186 | spermidine 3HCl
Type:
Small organic molecule
Emp. Form.:
C10H26N4
Mol. Mass.:
202.3402
SMILES:
NCCCNCCCCNCCCN
: