Target
Delta-type opioid receptor
Ligand
BDBM50323870
Substrate
Meas. Tech.
ChEMBL_647576 (CHEMBL1217623)
IC50
2.2±n/a nM
Citation
 Yamamoto, TNair, PJacobsen, NEKulkarni, VDavis, PMa, SWNavratilova, EYamamura, HIVanderah, TWPorreca, FLai, JHruby, VJ Biological and conformational evaluation of bifunctional compounds for opioid receptor agonists and neurokinin 1 receptor antagonists possessing two penicillamines. J Med Chem 53:5491-501 (2010)  
Target
Name:
Delta-type opioid receptor
Synonyms:
DOR-1 MSL-2 OPRD_MOUSE Oprd1
Type:
Enzyme Catalytic Domain
Mol. Mass.:
40577.25
Organism:
MOUSE
Description:
P32300
Residue:
372
  
Inhibitor
Name:
BDBM50323870
Synonyms:
(4S,7S,13R)-13-((S)-2-amino-3-(4-hydroxyphenyl)propanamido)-7-benzyl-3,3,14,14-tetramethyl-6,9,12-trioxo-1,2-dithia-5,8,11-triazacyclotetradecane-4-carboxylic acid | CHEMBL1214076
Type:
Small organic molecule
Emp. Form.:
C30H39N5O7S2
Mol. Mass.:
645.79
SMILES:
CC1(C)SSC(C)(C)[C@H](NC(=O)[C@@H](N)Cc2ccc(O)cc2)C(=O)NCC(=O)N[C@@H](Cc2ccccc2)C(=O)N[C@H]1C(O)=O
: