Target
Delta-type opioid receptor
Ligand
BDBM50324032
Substrate
Meas. Tech.
ChEMBL_647233 (CHEMBL1217374)
Ki
176.4±n/a nM
Citation
 Balboni, GMarzola, ESasaki, YAmbo, AMarczak, EDLazarus, LHSalvadori, S Role of 2',6'-dimethyl-l-tyrosine (Dmt) in some opioid lead compounds. Bioorg Med Chem 18:6024-30 (2010)  
Target
Name:
Delta-type opioid receptor
Synonyms:
Cytochrome P450 3A4 Delta opioid receptor Delta-type opioid receptor (DOR) OPRD_RAT Opioid receptor Opioid receptors; mu & delta Ror-a | Voltage-gated potassium channel
Type:
G Protein-Coupled Receptor (GPCR)
Mol. Mass.:
40465.04
Organism:
Rattus norvegicus (rat)
Description:
Competition binding assays were using CHO-K1 cell membranes expressing the opioid receptor.
Residue:
372
  
Inhibitor
Name:
BDBM50324032
Synonyms:
(S)-2-((S)-3-(2,6-difluoro-4-hydroxyphenyl)-2-(dimethylamino)propanoyl)-1,2,3,4-tetrahydroisoquinoline-3-carboxamide | CHEMBL1214118
Type:
Small organic molecule
Emp. Form.:
C21H23F2N3O3
Mol. Mass.:
403.4224
SMILES:
CN(C)[C@@H](Cc1c(F)cc(O)cc1F)C(=O)N1Cc2ccccc2C[C@H]1C(N)=O
: