Target
Mu-type opioid receptor
Ligand
BDBM50324027
Substrate
Meas. Tech.
ChEMBL_647234 (CHEMBL1217375)
Ki
1649±n/a nM
Citation
 Balboni, GMarzola, ESasaki, YAmbo, AMarczak, EDLazarus, LHSalvadori, S Role of 2',6'-dimethyl-l-tyrosine (Dmt) in some opioid lead compounds. Bioorg Med Chem 18:6024-30 (2010)  
Target
Name:
Mu-type opioid receptor
Synonyms:
MOR-1 Mu-type opioid receptor (MOR) OPRM_RAT Opioid receptor B Ror-b
Type:
G Protein-Coupled Receptor (GPCR)
Mol. Mass.:
44503.11
Organism:
Rattus norvegicus (rat)
Description:
Competition binding assays were carried out using membrane preparations from transfected HN9.10 cells that constitutively expressed the mu opioid receptor.
Residue:
398
  
Inhibitor
Name:
BDBM50324027
Synonyms:
(S)-2-((S)-2-((S)-2-amino-3-(4-hydroxyphenyl)propanoyl)-1,2,3,4-tetrahydroisoquinoline-3-carboxamido)-6-(benzylamino)hexanoic acid | CHEMBL1214048
Type:
Small organic molecule
Emp. Form.:
C32H38N4O5
Mol. Mass.:
558.6679
SMILES:
N[C@@H](Cc1ccc(O)cc1)C(=O)N1Cc2ccccc2C[C@H]1C(=O)N[C@@H](CCCCNCc1ccccc1)C(O)=O
: