Target
Polyphenol oxidase 2
Ligand
BDBM50324036
Substrate
Meas. Tech.
ChEMBL_647410 (CHEMBL1217571)
Ki
840±n/a nM
Citation
 Bandgar, BPTotre, JVGawande, SSKhobragade, CNWarangkar, SCKadam, PD Synthesis of novel 3,5-diaryl pyrazole derivatives using combinatorial chemistry as inhibitors of tyrosinase as well as potent anticancer, anti-inflammatory agents. Bioorg Med Chem 18:6149-55 (2010)  
Target
Name:
Polyphenol oxidase 2
Synonyms:
Monophenol monooxygenase PPO2 Tyrosinase
Type:
Protein
Mol. Mass.:
63923.66
Organism:
Agaricus bisporus (Common mushroom)
Description:
O42713
Residue:
556
  
Inhibitor
Name:
BDBM50324036
Synonyms:
2-[5-(2,4-Dimethoxy-phenyl)-1H-pyrazol-3-yl]-6-(2-hydroxymethyl-1-methyl-pyrrolidin-3-yl)-3,5-dimethoxy-phenol | CHEMBL1214309
Type:
Small organic molecule
Emp. Form.:
C25H31N3O6
Mol. Mass.:
469.5301
SMILES:
COc1ccc(-c2cc([nH]n2)-c2c(OC)cc(OC)c(C3CCN(C)C3CO)c2O)c(OC)c1
: