Target
Chitinase B
Ligand
BDBM50173286
Substrate
Meas. Tech.
ChEMBL_649695 (CHEMBL1219393)
IC50
6400±n/a nM
Citation
 Gouda, HSunazuka, THirose, TIguchi, KYamaotsu, NSugawara, ANoguchi, YSaito, YYamamoto, TWatanabe, TShiomi, KOmura, SHirono, S NMR spectroscopy and computational analysis of interaction between Serratia marcescens chitinase B and a dipeptide derived from natural-product cyclopentapeptide chitinase inhibitor argifin. Bioorg Med Chem 18:5835-44 (2010)  
Target
Name:
Chitinase B
Synonyms:
CHIB_SERMA | chiB
Type:
Enzyme
Mol. Mass.:
55462.70
Organism:
Serratia marcescens
Description:
P11797
Residue:
499
  
Inhibitor
Name:
BDBM50173286
Synonyms:
5-[3-[amino-(methylcarbamoylamino)methylidene]aminopropyl]-8-benzyl-2,7-dimethyl-3,6,9,13,17-pentaoxo-1,4,7,10,14-pentazacycloheptadecane-11,15-dicarboxylic acid | CHEMBL197199
Type:
Small organic molecule
Emp. Form.:
C29H41N9O10
Mol. Mass.:
675.6901
SMILES:
CNC(=O)NC(N)=NCCC[C@@H]1NC(=O)[C@@H](C)NC(=O)C[C@H](NC(=O)C[C@H](NC(=O)[C@H](Cc2ccccc2)N(C)C1=O)C(O)=O)C(O)=O
: