Target
Serine/threonine-protein kinase D1
Ligand
BDBM50324325
Substrate
Meas. Tech.
ChEMBL_650173 (CHEMBL1219871)
EC50
>1000±n/a nM
Citation
 Meredith, ELBeattie, KBurgis, RCapparelli, MChapo, JDipietro, LGamber, GEnyedy, IHood, DBHosagrahara, VJewell, CKoch, KALee, WLemon, DDMcKinsey, TAMiranda, KPagratis, NPhan, DPlato, CRao, CRozhitskaya, OSoldermann, NSpringer, Cvan Eis, MVega, RBYan, WZhu, QMonovich, LG Identification of potent and selective amidobipyridyl inhibitors of protein kinase D. J Med Chem 53:5422-38 (2010)  
Target
Name:
Serine/threonine-protein kinase D1
Synonyms:
KPCD1_HUMAN PKD1 PRKD1 Protein kinase C mu type Protein kinase C, PKC; classical/novel Protein kinase D (PRKD1) nPKC-D1 | nPKC-mu
Type:
Serine/threonine-protein kinase
Mol. Mass.:
101705.07
Organism:
Homo sapiens (Human)
Description:
gi_115529463
Residue:
912
  
Inhibitor
Name:
BDBM50324325
Synonyms:
6-Piperazin-1-yl-2'-(tetrahydropyran-4-ylamino)[2,4']bipyridinyl-4-carboxylic Acid Amide. | CHEMBL1215001
Type:
Small organic molecule
Emp. Form.:
C20H26N6O2
Mol. Mass.:
382.4594
SMILES:
NC(=O)c1cc(nc(c1)-c1ccnc(NC2CCOCC2)c1)N1CCNCC1
: