Target
Serine/threonine-protein kinase D1
Ligand
BDBM50324323
Substrate
Meas. Tech.
ChEMBL_650172 (CHEMBL1219870)
IC50
1±n/a nM
Citation
 Meredith, ELBeattie, KBurgis, RCapparelli, MChapo, JDipietro, LGamber, GEnyedy, IHood, DBHosagrahara, VJewell, CKoch, KALee, WLemon, DDMcKinsey, TAMiranda, KPagratis, NPhan, DPlato, CRao, CRozhitskaya, OSoldermann, NSpringer, Cvan Eis, MVega, RBYan, WZhu, QMonovich, LG Identification of potent and selective amidobipyridyl inhibitors of protein kinase D. J Med Chem 53:5422-38 (2010)  
Target
Name:
Serine/threonine-protein kinase D1
Synonyms:
KPCD1_HUMAN PKD1 PRKD1 Protein kinase C mu type Protein kinase C, PKC; classical/novel Protein kinase D (PRKD1) nPKC-D1 | nPKC-mu
Type:
Serine/threonine-protein kinase
Mol. Mass.:
101705.07
Organism:
Homo sapiens (Human)
Description:
gi_115529463
Residue:
912
  
Inhibitor
Name:
BDBM50324323
Synonyms:
2'-Cyclohexylamino-6-piperazin-1-yl[2,4']bipyridinyl-4-carboxylicAcid Amide | CHEMBL1214999
Type:
Small organic molecule
Emp. Form.:
C21H28N6O
Mol. Mass.:
380.4866
SMILES:
NC(=O)c1cc(nc(c1)-c1ccnc(NC2CCCCC2)c1)N1CCNCC1
: