Target
Serine/threonine-protein kinase D1
Ligand
BDBM50324337
Substrate
Meas. Tech.
ChEMBL_650172 (CHEMBL1219870)
IC50
6±n/a nM
Citation
 Meredith, ELBeattie, KBurgis, RCapparelli, MChapo, JDipietro, LGamber, GEnyedy, IHood, DBHosagrahara, VJewell, CKoch, KALee, WLemon, DDMcKinsey, TAMiranda, KPagratis, NPhan, DPlato, CRao, CRozhitskaya, OSoldermann, NSpringer, Cvan Eis, MVega, RBYan, WZhu, QMonovich, LG Identification of potent and selective amidobipyridyl inhibitors of protein kinase D. J Med Chem 53:5422-38 (2010)  
Target
Name:
Serine/threonine-protein kinase D1
Synonyms:
KPCD1_HUMAN PKD1 PRKD1 Protein kinase C mu type Protein kinase C, PKC; classical/novel Protein kinase D (PRKD1) nPKC-D1 | nPKC-mu
Type:
Serine/threonine-protein kinase
Mol. Mass.:
101705.07
Organism:
Homo sapiens (Human)
Description:
gi_115529463
Residue:
912
  
Inhibitor
Name:
BDBM50324337
Synonyms:
2'-Cyclohexylamino-6-((R)-3-methylpiperazin-1-yl)[2,4']bipyridinyl-4-carboxylic Acid Amide | CHEMBL1215222
Type:
Small organic molecule
Emp. Form.:
C22H30N6O
Mol. Mass.:
394.5132
SMILES:
C[C@@H]1CN(CCN1)c1cc(cc(n1)-c1ccnc(NC2CCCCC2)c1)C(N)=O
: