Target
Polycystin-2
Ligand
BDBM50324331
Substrate
Meas. Tech.
ChEMBL_650175 (CHEMBL1219873)
IC50
130±n/a nM
Citation
 Meredith, ELBeattie, KBurgis, RCapparelli, MChapo, JDipietro, LGamber, GEnyedy, IHood, DBHosagrahara, VJewell, CKoch, KALee, WLemon, DDMcKinsey, TAMiranda, KPagratis, NPhan, DPlato, CRao, CRozhitskaya, OSoldermann, NSpringer, Cvan Eis, MVega, RBYan, WZhu, QMonovich, LG Identification of potent and selective amidobipyridyl inhibitors of protein kinase D. J Med Chem 53:5422-38 (2010)  
Target
Name:
Polycystin-2
Synonyms:
PKD2 TRPP2
Type:
PROTEIN
Mol. Mass.:
109676.85
Organism:
Homo sapiens (Human)
Description:
ChEMBL_886731
Residue:
968
  
Inhibitor
Name:
BDBM50324331
Synonyms:
2'-Cyclohexylamino-6-piperazin-1-yl[2,4']bipyridinyl-4-carbonitrile | CHEMBL1215078
Type:
Small organic molecule
Emp. Form.:
C21H26N6
Mol. Mass.:
362.4713
SMILES:
N#Cc1cc(nc(c1)-c1ccnc(NC2CCCCC2)c1)N1CCNCC1
: