Target
Polycystin-2
Ligand
BDBM50324334
Substrate
Meas. Tech.
ChEMBL_650175 (CHEMBL1219873)
IC50
62±n/a nM
Citation
 Meredith, ELBeattie, KBurgis, RCapparelli, MChapo, JDipietro, LGamber, GEnyedy, IHood, DBHosagrahara, VJewell, CKoch, KALee, WLemon, DDMcKinsey, TAMiranda, KPagratis, NPhan, DPlato, CRao, CRozhitskaya, OSoldermann, NSpringer, Cvan Eis, MVega, RBYan, WZhu, QMonovich, LG Identification of potent and selective amidobipyridyl inhibitors of protein kinase D. J Med Chem 53:5422-38 (2010)  
Target
Name:
Polycystin-2
Synonyms:
PKD2 TRPP2
Type:
PROTEIN
Mol. Mass.:
109676.85
Organism:
Homo sapiens (Human)
Description:
ChEMBL_886731
Residue:
968
  
Inhibitor
Name:
BDBM50324334
Synonyms:
CHEMBL1215152 | Cyclohexyl-[6-piperazin-1-yl-4-(2H-pyrazol-3-yl)[2,4']bipyridinyl-2'-yl]amine
Type:
Small organic molecule
Emp. Form.:
C23H29N7
Mol. Mass.:
403.5233
SMILES:
C1CCC(CC1)Nc1cc(ccn1)-c1cc(cc(n1)N1CCNCC1)-c1cc[nH]n1
: