Target
Glutamate receptor ionotropic, NMDA 1/2C
Ligand
BDBM50324430
Substrate
Meas. Tech.
ChEMBL_650214 (CHEMBL1219912)
IC50
21000±n/a nM
Citation
 Mosley, CAAcker, TMHansen, KBMullasseril, PAndersen, KTLe, PVellano, KMBräuner-Osborne, HLiotta, DCTraynelis, SF Quinazolin-4-one derivatives: A novel class of noncompetitive NR2C/D subunit-selective N-methyl-D-aspartate receptor antagonists. J Med Chem 53:5476-90 (2010)  
Target
Name:
Glutamate receptor ionotropic, NMDA 1/2C
Synonyms:
Glutamate NMDA receptor; Grin1/Grin2c | Glutamate [NMDA] receptor subunit epsilon 3/zeta 1
Type:
Mol. Mass.:
Description:
ASSAY_ID of EBI is 141029
Components:
This complex has 2 components.
Component 1
Name:
Glutamate receptor ionotropic, NMDA 1
Synonyms:
Glutamate (NMDA) receptor subunit zeta 1 Glutamate-NMDA-Channel Glutamate-NMDA-Polyamine NMDA Nmdar1 | phencyclidine
Type:
Enzyme Catalytic Domain
Mol. Mass.:
105533.40
Organism:
RAT
Description:
P35439
Residue:
938
  
Component 2
Name:
Glutamate receptor ionotropic, NMDA 2C
Synonyms:
Glutamate NMDA receptor; Grin1/Grin2c Grin2c NMDE3_RAT
Type:
Protein
Mol. Mass.:
135305.94
Organism:
Rattus norvegicus (Rat)
Description:
Q00961
Residue:
1237
  
Inhibitor
Name:
BDBM50324430
Synonyms:
(E)-3-(6-Methoxy-2-(4-nitrostyryl)-4-oxoquinazolin-3(4H)-yl)-benzoic Acid | CHEMBL1215803
Type:
Small organic molecule
Emp. Form.:
C24H17N3O6
Mol. Mass.:
443.4083
SMILES:
COc1ccc2nc(\C=C\c3ccc(cc3)[N+]([O-])=O)n(-c3cccc(c3)C(O)=O)c(=O)c2c1
: