Target
Hematopoietic prostaglandin D synthase
Ligand
BDBM50324482
Substrate
Meas. Tech.
ChEMBL_649226 (CHEMBL1218924)
IC50
1000±n/a nM
Citation
 Christ, ANLabzin, LBourne, GTFukunishi, HWeber, JESweet, MJSmythe, MLFlanagan, JU Development and characterization of new inhibitors of the human and mouse hematopoietic prostaglandin D(2) synthases. J Med Chem 53:5536-48 (2010)  
Target
Name:
Hematopoietic prostaglandin D synthase
Synonyms:
GSTS Glutathione-requiring prostaglandin D synthase HPGDS Hematopoietic prostaglandin D synthase Hematopoietic prostaglandin D synthase (HPGDS) PTGDS2 Prostaglandin D Synthase
Type:
Enzyme
Mol. Mass.:
23341.07
Organism:
Homo sapiens (Human)
Description:
The protein was expressed in E. coli strain BL21(DE3) with an N-terminal 6-His tag.
Residue:
199
  
Inhibitor
Name:
BDBM50324482
Synonyms:
CHEMBL1215370 | N-(1-Amino-3-(1H-indol-3-yl)-1-oxopropan-2-yl)-30-hydroxybiphenyl-4-carboxamide
Type:
Small organic molecule
Emp. Form.:
C24H21N3O3
Mol. Mass.:
399.4418
SMILES:
NC(=O)C(Cc1c[nH]c2ccccc12)NC(=O)c1ccc(cc1)-c1cccc(O)c1
: