Target
Hematopoietic prostaglandin D synthase
Ligand
BDBM50300127
Substrate
Meas. Tech.
ChEMBL_649226 (CHEMBL1218924)
IC50
12800±n/a nM
Citation
 Christ, ANLabzin, LBourne, GTFukunishi, HWeber, JESweet, MJSmythe, MLFlanagan, JU Development and characterization of new inhibitors of the human and mouse hematopoietic prostaglandin D(2) synthases. J Med Chem 53:5536-48 (2010)  
Target
Name:
Hematopoietic prostaglandin D synthase
Synonyms:
GSTS Glutathione-requiring prostaglandin D synthase HPGDS Hematopoietic prostaglandin D synthase Hematopoietic prostaglandin D synthase (HPGDS) PTGDS2 Prostaglandin D Synthase
Type:
Enzyme
Mol. Mass.:
23341.07
Organism:
Homo sapiens (Human)
Description:
The protein was expressed in E. coli strain BL21(DE3) with an N-terminal 6-His tag.
Residue:
199
  
Inhibitor
Name:
BDBM50300127
Synonyms:
CHEMBL567059 phenyl(thiophen-2-yl)methanone
Type:
Small organic molecule
Emp. Form.:
C11H8OS
Mol. Mass.:
188.246
SMILES:
O=C(c1cccs1)c1ccccc1
: