Target
Dipeptidyl peptidase 9
Ligand
BDBM50324512
Substrate
Meas. Tech.
ChEMBL_649274 (CHEMBL1218972)
Ki
0.19±n/a nM
Citation
 Meng, WBrigance, RPChao, HJFura, AHarrity, TMarcinkeviciene, JO'Connor, SPTamura, JKXie, DZhang, YKlei, HEKish, KWeigelt, CATurdi, HWang, AZahler, RKirby, MSHamann, LG Discovery of 6-(aminomethyl)-5-(2,4-dichlorophenyl)-7-methylimidazo[1,2-a]pyrimidine-2-carboxamides as potent, selective dipeptidyl peptidase-4 (DPP4) inhibitors. J Med Chem 53:5620-8 (2010)  
Target
Name:
Dipeptidyl peptidase 9
Synonyms:
DPP9 DPRP-2 Dipeptidyl peptidase 9 (DDP9) Dipeptidyl peptidase 9 (DPP9) Dipeptidyl peptidase IX Dipeptidyl peptidase-like protein 9
Type:
Enzyme
Mol. Mass.:
98260.70
Organism:
Homo sapiens (Human)
Description:
Q86TI2
Residue:
863
  
Inhibitor
Name:
BDBM50324512
Synonyms:
6-(aminomethyl)-5-(2,4-dichlorophenyl)-7-methyl-N-(2-(pyridin-2-yl)ethyl)imidazo[1,2-a]pyrimidine-2-carboxamide | CHEMBL1215376
Type:
Small organic molecule
Emp. Form.:
C22H20Cl2N6O
Mol. Mass.:
455.34
SMILES:
Cc1nc2nc(cn2c(c1CN)-c1ccc(Cl)cc1Cl)C(=O)NCCc1ccccn1
: