Target
5-hydroxytryptamine receptor 2A
Ligand
BDBM50324545
Substrate
Meas. Tech.
ChEMBL_649396 (CHEMBL1219094)
Ki
3.6±n/a nM
Citation
 Xiong, YUllman, BChoi, JSCherrier, MStrah-Pleynet, SDecaire, MDosa, PIFeichtinger, KTeegarden, BRFrazer, JMYoon, WHShan, YWhelan, KHauser, EKGrottick, AJSemple, GAl-Shamma, H Synthesis and in vivo evaluation of phenethylpiperazine amides: selective 5-hydroxytryptamine(2A) receptor antagonists for the treatment of insomnia. J Med Chem 53:5696-706 (2010)  
Target
Name:
5-hydroxytryptamine receptor 2A
Synonyms:
5-HT-2 5-HT2A 5-hydroxytryptamine receptor 2A (5HT-2A) 5HT2A_HUMAN HTR2A | Serotonin receptor 2A
Type:
undefined
Mol. Mass.:
52607.65
Organism:
Homo sapiens (Human)
Description:
P28223
Residue:
471
  
Inhibitor
Name:
BDBM50324545
Synonyms:
(4-Bromo-1-methyl-1Hpyrazol-3-yl)-{4-[2-(4-fluorophenyl)ethyl]piperazin-1-yl}methanone | CHEMBL1215727
Type:
Small organic molecule
Emp. Form.:
C17H20BrFN4O
Mol. Mass.:
395.269
SMILES:
Cn1cc(Br)c(n1)C(=O)N1CCN(CCc2ccc(F)cc2)CC1
: