Target
Monocarboxylate transporter 1
Ligand
BDBM21986
Substrate
Meas. Tech.
ChEMBL_653482 (CHEMBL1226685)
Ki
0.331131±n/a nM
Citation
Target
Name:
Monocarboxylate transporter 1
Synonyms:
MCT 1 MOT1_HUMAN SLC16A1 | Solute carrier family 16 member 1
Type:
PROTEIN
Mol. Mass.:
53956.64
Organism:
Homo sapiens (Human)
Description:
ChEMBL_1451367
Residue:
500
  
Inhibitor
Name:
BDBM21986
Synonyms:
5-[(3-hydroxypropyl)sulfanyl]-3-methyl-1-(2-methylpropyl)-6-(naphthalen-1-ylmethyl)-1H,2H,3H,4H,6H-pyrrolo[3,4-d]pyrimidine-2,4-dione CHEMBL85752 [3H]-pyrrolo[3,4-d]pyrimidine-2,4(3H,6H)-dione
Type:
Emp. Form.:
C25H29N3O3S
Mol. Mass.:
451.581
SMILES:
CC(C)Cn1c2cn(Cc3cccc4ccccc34)c(SCCCO)c2c(=O)n(C)c1=O
: