Target
Monocarboxylate transporter 1
Ligand
BDBM50031739
Substrate
Meas. Tech.
ChEMBL_653483 (CHEMBL1226686)
Ki
47±n/a nM
Citation
Target
Name:
Monocarboxylate transporter 1
Synonyms:
MCT 1 MOT1_HUMAN SLC16A1 | Solute carrier family 16 member 1
Type:
PROTEIN
Mol. Mass.:
53956.64
Organism:
Homo sapiens (Human)
Description:
ChEMBL_1451367
Residue:
500
  
Inhibitor
Name:
BDBM50031739
Synonyms:
1-Isobutyl-3-methyl-6-naphthalen-1-ylmethyl-1,6-dihydro-pyrrolo[3,4-d]pyrimidine-2,4-dione CHEMBL315970
Type:
Small organic molecule
Emp. Form.:
C22H23N3O2
Mol. Mass.:
361.4369
SMILES:
CC(C)Cn1c2cn(Cc3cccc4ccccc34)cc2c(=O)n(C)c1=O
: