Target
Serine-protein kinase ATM
Ligand
BDBM50324675
Substrate
Meas. Tech.
ChEMBL_653383 (CHEMBL1226586)
IC50
200±n/a nM
Citation
 Won, JKim, MKim, NAhn, JHLee, WGKim, SSChang, KYYi, YWKim, TK Small molecule-based reversible reprogramming of cellular lifespan. Nat Chem Biol 2:369-74 (2006)  
Target
Name:
Serine-protein kinase ATM
Synonyms:
A-T mutated ATM_HUMAN | Ataxia telangiectasia mutated
Type:
Protein
Mol. Mass.:
350696.72
Organism:
Homo sapiens (Human)
Description:
Q13315
Residue:
3056
  
Inhibitor
Name:
BDBM50324675
Synonyms:
2,2-diphenyl-N-(2,2,2-trichloro-1-(3-(4-fluoro-3-nitrophenyl)thioureido)ethyl)acetamide | CHEMBL1221601
Type:
Small organic molecule
Emp. Form.:
C23H18Cl3FN4O3S
Mol. Mass.:
555.836
SMILES:
[O-][N+](=O)c1cc(NC(=S)NC(NC(=O)C(c2ccccc2)c2ccccc2)C(Cl)(Cl)Cl)ccc1F
: