Target
Monoglyceride lipase
Ligand
BDBM50132717
Substrate
Meas. Tech.
ChEMBL_653421 (CHEMBL1226624)
IC50
0.8±n/a nM
Citation
 Nomura, DKBlankman, JLSimon, GMFujioka, KIssa, RSWard, AMCravatt, BFCasida, JE Activation of the endocannabinoid system by organophosphorus nerve agents. Nat Chem Biol 4:373-8 (2008)  
Target
Name:
Monoglyceride lipase
Synonyms:
MAG lipase Mgll Monoglyceride Lipase (MGL)
Type:
Hydrolase
Mol. Mass.:
33391.67
Organism:
Mus musculus (mouse)
Description:
Assays were using membranes of recombinant MAG Lipase transiently transfected in COS-7 cells.
Residue:
303
  
Inhibitor
Name:
BDBM50132717
Synonyms:
CHEMBL333149 isopropyl dodecylphosphonofluoridate | isopropyl dodecylphosphonofluoridoate
Type:
Small organic molecule
Emp. Form.:
C15H32FO2P
Mol. Mass.:
294.3855
SMILES:
CCCCCCCCCCCCP(F)(=O)OC(C)C
: