Target
Fatty-acid amide hydrolase 1
Ligand
BDBM50132717
Substrate
Meas. Tech.
ChEMBL_653616 (CHEMBL1226988)
IC50
3±n/a nM
Citation
 Nomura, DKBlankman, JLSimon, GMFujioka, KIssa, RSWard, AMCravatt, BFCasida, JE Activation of the endocannabinoid system by organophosphorus nerve agents. Nat Chem Biol 4:373-8 (2008)  
Target
Name:
Fatty-acid amide hydrolase 1
Synonyms:
Anandamide amidohydrolase FAAH1_MOUSE Faah1 Fatty-acid amide hydrolase (FAAH) Oleamide hydrolase 1
Type:
Hydrolase; single-pass membrane protein; homodimer
Mol. Mass.:
63227.28
Organism:
Mus musculus (mouse)
Description:
Mouse brain membranes were used in the assay.
Residue:
579
  
Inhibitor
Name:
BDBM50132717
Synonyms:
CHEMBL333149 isopropyl dodecylphosphonofluoridate | isopropyl dodecylphosphonofluoridoate
Type:
Small organic molecule
Emp. Form.:
C15H32FO2P
Mol. Mass.:
294.3855
SMILES:
CCCCCCCCCCCCP(F)(=O)OC(C)C
: