Target
Integrin alpha-L
Ligand
BDBM50324825
Substrate
Meas. Tech.
ChEMBL_651448 (CHEMBL1227565)
Kd
26±n/a nM
Citation
 Zhong, MShen, WBarr, KJArbitrario, JPArkin, MRBui, MChen, TCunningham, BCEvanchik, MJHanan, EJHoch, UHuen, KHyde, JKumer, JLLac, TLawrence, CEMartell, JROslob, JDPaulvannan, KPrabhu, SSilverman, JAWright, JYu, CHZhu, JFlanagan, WM Discovery of tetrahydroisoquinoline (THIQ) derivatives as potent and orally bioavailable LFA-1/ICAM-1 antagonists. Bioorg Med Chem Lett 20:5269-73 (2010)  
Target
Name:
Integrin alpha-L
Synonyms:
CD11 antigen-like family member A CD_antigen=CD11a ITGAL LFA-1A Leukocyte adhesion glycoprotein LFA-1 alpha chain | Leukocyte function-associated molecule 1 alpha chain
Type:
PROTEIN
Mol. Mass.:
128748.90
Organism:
Homo sapiens (Human)
Description:
ChEMBL_629045
Residue:
1170
  
Inhibitor
Name:
BDBM50324825
Synonyms:
(R)-5-(4-bromobenzyl)-3-(3,5-dichlorophenyl)-5-methylimidazolidine-2,4-dione | CHEMBL1221917
Type:
Small organic molecule
Emp. Form.:
C17H13BrCl2N2O2
Mol. Mass.:
428.107
SMILES:
C[C@]1(Cc2ccc(Br)cc2)NC(=O)N(C1=O)c1cc(Cl)cc(Cl)c1
: