Target
Beta-2 adrenergic receptor
Ligand
BDBM50324845
Substrate
Meas. Tech.
ChEMBL_651475 (CHEMBL1227592)
Ki
20±n/a nM
Citation
 Beattie, DBradley, MBrearley, ACharlton, SJCuenoud, BMFairhurst, RAGedeck, PGosling, MJanus, DJones, DLewis, CMcCarthy, COakman, HStringer, RTaylor, RJTuffnell, A A physical properties based approach for the exploration of a 4-hydroxybenzothiazolone series of beta2-adrenoceptor agonists as inhaled long-acting bronchodilators. Bioorg Med Chem Lett 20:5302-7 (2010)  
Target
Name:
Beta-2 adrenergic receptor
Synonyms:
ADRB2 ADRB2_HUMAN Beta-2 adrenoceptor | Beta-2 adrenoreceptor
Type:
Mol. Mass.:
46461.69
Organism:
Homo sapiens (Human)
Description:
P07550
Residue:
413
  
Inhibitor
Name:
BDBM50324845
Synonyms:
(R)-4-hydroxy-7-(1-hydroxy-2-((5-methyl-3-phenylisoxazol-4-yl)methylamino)ethyl)benzo[d]thiazol-2(3H)-one | CHEMBL1221588
Type:
Small organic molecule
Emp. Form.:
C20H19N3O4S
Mol. Mass.:
397.448
SMILES:
Cc1onc(c1CNC[C@H](O)c1ccc(O)c2[nH]c(=O)sc12)-c1ccccc1
: