Target
Beta-2 adrenergic receptor
Ligand
BDBM50324838
Substrate
Meas. Tech.
ChEMBL_651475 (CHEMBL1227592)
Ki
18±n/a nM
Citation
 Beattie, DBradley, MBrearley, ACharlton, SJCuenoud, BMFairhurst, RAGedeck, PGosling, MJanus, DJones, DLewis, CMcCarthy, COakman, HStringer, RTaylor, RJTuffnell, A A physical properties based approach for the exploration of a 4-hydroxybenzothiazolone series of beta2-adrenoceptor agonists as inhaled long-acting bronchodilators. Bioorg Med Chem Lett 20:5302-7 (2010)  
Target
Name:
Beta-2 adrenergic receptor
Synonyms:
ADRB2 ADRB2_HUMAN Beta-2 adrenoceptor | Beta-2 adrenoreceptor
Type:
Mol. Mass.:
46461.69
Organism:
Homo sapiens (Human)
Description:
P07550
Residue:
413
  
Inhibitor
Name:
BDBM50324838
Synonyms:
(R)-7-(2-(2-(dibutylamino)ethylamino)-1-hydroxyethyl)-4-hydroxybenzo[d]thiazol-2(3H)-one | CHEMBL1221862
Type:
Small organic molecule
Emp. Form.:
C19H31N3O3S
Mol. Mass.:
381.533
SMILES:
CCCCN(CCCC)CCNC[C@H](O)c1ccc(O)c2[nH]c(=O)sc12
: