Target
Beta-1 adrenergic receptor
Ligand
BDBM50324833
Substrate
Meas. Tech.
ChEMBL_651476 (CHEMBL1227593)
Ki
187±n/a nM
Citation
 Beattie, DBradley, MBrearley, ACharlton, SJCuenoud, BMFairhurst, RAGedeck, PGosling, MJanus, DJones, DLewis, CMcCarthy, COakman, HStringer, RTaylor, RJTuffnell, A A physical properties based approach for the exploration of a 4-hydroxybenzothiazolone series of beta2-adrenoceptor agonists as inhaled long-acting bronchodilators. Bioorg Med Chem Lett 20:5302-7 (2010)  
Target
Name:
Beta-1 adrenergic receptor
Synonyms:
ADRB1 ADRB1_HUMAN Beta-1 adrenoceptor | adrenergic Beta1
Type:
G Protein-Coupled Receptor (GPCR)
Mol. Mass.:
51338.40
Organism:
Homo sapiens (Human)
Description:
P08588
Residue:
477
  
Inhibitor
Name:
BDBM50324833
Synonyms:
(R)-7-(2-(1-(2-(azepan-1-yl)ethyl)piperidin-4-ylamino)-1-hydroxyethyl)-4-hydroxybenzo[d]thiazol-2(3H)-one | CHEMBL1221802
Type:
Small organic molecule
Emp. Form.:
C22H34N4O3S
Mol. Mass.:
434.595
SMILES:
O[C@@H](CNC1CCN(CCN2CCCCCC2)CC1)c1ccc(O)c2[nH]c(=O)sc12
: