Target
Beta-1 adrenergic receptor
Ligand
BDBM50324844
Substrate
Meas. Tech.
ChEMBL_651476 (CHEMBL1227593)
Ki
3.8±n/a nM
Citation
 Beattie, DBradley, MBrearley, ACharlton, SJCuenoud, BMFairhurst, RAGedeck, PGosling, MJanus, DJones, DLewis, CMcCarthy, COakman, HStringer, RTaylor, RJTuffnell, A A physical properties based approach for the exploration of a 4-hydroxybenzothiazolone series of beta2-adrenoceptor agonists as inhaled long-acting bronchodilators. Bioorg Med Chem Lett 20:5302-7 (2010)  
Target
Name:
Beta-1 adrenergic receptor
Synonyms:
ADRB1 ADRB1_HUMAN Beta-1 adrenoceptor | adrenergic Beta1
Type:
G Protein-Coupled Receptor (GPCR)
Mol. Mass.:
51338.40
Organism:
Homo sapiens (Human)
Description:
P08588
Residue:
477
  
Inhibitor
Name:
BDBM50324844
Synonyms:
(R)-4-hydroxy-7-(1-hydroxy-2-(phenethylamino)ethyl)benzo[d]thiazol-2(3H)-one | CHEMBL1221587
Type:
Small organic molecule
Emp. Form.:
C17H18N2O3S
Mol. Mass.:
330.401
SMILES:
O[C@@H](CNCCc1ccccc1)c1ccc(O)c2[nH]c(=O)sc12
: