Target
Beta-1 adrenergic receptor
Ligand
BDBM50324845
Substrate
Meas. Tech.
ChEMBL_651476 (CHEMBL1227593)
Ki
902±n/a nM
Citation
 Beattie, DBradley, MBrearley, ACharlton, SJCuenoud, BMFairhurst, RAGedeck, PGosling, MJanus, DJones, DLewis, CMcCarthy, COakman, HStringer, RTaylor, RJTuffnell, A A physical properties based approach for the exploration of a 4-hydroxybenzothiazolone series of beta2-adrenoceptor agonists as inhaled long-acting bronchodilators. Bioorg Med Chem Lett 20:5302-7 (2010)  
Target
Name:
Beta-1 adrenergic receptor
Synonyms:
ADRB1 ADRB1_HUMAN Beta-1 adrenoceptor adrenergic Beta1
Type:
G Protein-Coupled Receptor (GPCR)
Mol. Mass.:
51338.40
Organism:
Homo sapiens (Human)
Description:
P08588
Residue:
477
  
Inhibitor
Name:
BDBM50324845
Synonyms:
(R)-4-hydroxy-7-(1-hydroxy-2-((5-methyl-3-phenylisoxazol-4-yl)methylamino)ethyl)benzo[d]thiazol-2(3H)-one | CHEMBL1221588
Type:
Small organic molecule
Emp. Form.:
C20H19N3O4S
Mol. Mass.:
397.448
SMILES:
Cc1onc(c1CNC[C@H](O)c1ccc(O)c2[nH]c(=O)sc12)-c1ccccc1
: