Target
Adenosine receptor A1
Ligand
BDBM50176050
Substrate
Meas. Tech.
ChEMBL_651580 (CHEMBL1227963)
Ki
3000±n/a nM
Citation
 Sams, AGMikkelsen, GKLarsen, MTorup, LBrennum, LTSchrøder, TJBang-Andersen, B Hit-to-lead optimization of a series of carboxamides of ethyl 2-amino-4-phenylthiazole-5-carboxylates as novel adenosine A2A receptor antagonists. Bioorg Med Chem Lett 20:5241-4 (2010)  
Target
Name:
Adenosine receptor A1
Synonyms:
A1 adenosine receptor (hA1) AA1R_HUMAN ADORA1 Adenosine A1-receptor Adenosine receptor A1 (hA1) | Adenosine transporter (AdT)
Type:
G Protein-Coupled Receptor (GPCR)
Mol. Mass.:
36520.92
Organism:
Homo sapiens (Human)
Description:
P30542
Residue:
326
  
Inhibitor
Name:
BDBM50176050
Synonyms:
8-(3,4-dimethoxystyryl)-1,3-diethyl-7-methyl-1H-purine-2,6(3H,7H)-dione 8-[2-(3,4-dimethoxy-phenyl)-vinyl]-1,3-diethyl-7-methyl-3,9-dihydro-purine-2,6-dione US11806350, Compound Istradefylline | istradefylline
Type:
Small organic molecule
Emp. Form.:
C20H24N4O4
Mol. Mass.:
384.429
SMILES:
CCn1c2nc(\C=C\c3ccc(OC)c(OC)c3)n(C)c2c(=O)n(CC)c1=O
: