Target
Serine/threonine-protein kinase Chk1
Ligand
BDBM50325160
Substrate
Meas. Tech.
ChEMBL_651698 (CHEMBL1228388)
IC50
24400±n/a nM
Citation
 Oza, VAshwell, SBrassil, PBreed, JDeng, CEzhuthachan, JHaye, HHorn, CJanetka, JLyne, PNewcombe, NOtterbien, LPass, MRead, JRoswell, SSu, MToader, DYu, DYu, YValentine, AWebborn, PWhite, AZabludoff, SZheng, X Discovery of a novel class of triazolones as checkpoint kinase inhibitors--hit to lead exploration. Bioorg Med Chem Lett 20:5133-8 (2010)  
Target
Name:
Serine/threonine-protein kinase Chk1
Synonyms:
CHEK1 CHK1 checkpoint homolog Checkpoint kinase-1 (CHK1)
Type:
Enzyme Catalytic Domain
Mol. Mass.:
54443.02
Organism:
Homo sapiens (Human)
Description:
gi_166295192
Residue:
476
  
Inhibitor
Name:
BDBM50325160
Synonyms:
8-(2-aminophenyl)-5-methyl-[1,2,4]triazolo[4,3-a]quinolin-1(2H)-one | CHEMBL1223319
Type:
Small organic molecule
Emp. Form.:
C17H14N4O
Mol. Mass.:
290.3193
SMILES:
Cc1cc2n[nH]c(=O)n2c2cc(ccc12)-c1ccccc1N
: