Target
Thrombopoietin receptor
Ligand
BDBM50325422
Substrate
Meas. Tech.
ChEMBL_652150 (CHEMBL1228259)
EC50
103±n/a nM
Citation
 Tang, PCLu, HJChen, YQWang, SLZheng, HWang, L Synthesis and biological evaluation of oxoindolin-3-ylidene ethyl benzothiohydrazides as non-peptide TPO mimics. Bioorg Med Chem Lett 20:5062-4 (2010)  
Target
Name:
Thrombopoietin receptor
Synonyms:
C-mpl MPL TPO-R TPOR_HUMAN
Type:
PROTEIN
Mol. Mass.:
71243.48
Organism:
Homo sapiens (Human)
Description:
ChEMBL_535587
Residue:
635
  
Inhibitor
Name:
BDBM50325422
Synonyms:
4-(2-(1-(1-(3,4-dimethylphenyl)-5-fluoro-2-oxoindolin-3-ylidene)ethyl)hydrazinecarbonothioyl)benzoic acid | CHEMBL1222641
Type:
Small organic molecule
Emp. Form.:
C26H22FN3O3S
Mol. Mass.:
475.535
SMILES:
CC(=NNC(=S)c1ccc(cc1)C(O)=O)C1C(=O)N(c2ccc(F)cc12)c1ccc(C)c(C)c1
: