Target
cAMP-specific 3',5'-cyclic phosphodiesterase 4C
Ligand
BDBM50325786
Substrate
Meas. Tech.
ChEMBL_652842 (CHEMBL1226045)
IC50
151±n/a nM
Citation
 Aspiotis, RDeschênes, DDubé, DGirard, YHuang, ZLaliberté, FLiu, SPapp, RNicholson, DWYoung, RN The discovery and synthesis of highly potent subtype selective phosphodiesterase 4D inhibitors. Bioorg Med Chem Lett 20:5502-5 (2010)  
Target
Name:
cAMP-specific 3',5'-cyclic phosphodiesterase 4C
Synonyms:
3',5'-cyclic phosphodiesterase NP_000914.2 PDE4C | PDE4C1
Type:
Enzyme Catalytic Domain
Mol. Mass.:
79875.54
Organism:
Homo sapiens (Human)
Description:
Q08493
Residue:
712
  
Inhibitor
Name:
BDBM50325786
Synonyms:
4-(4-((8-(3-(difluoromethoxy)phenyl)quinolin-6-yl)methoxy)phenyl)-2-methylbutan-2-ol | CHEMBL1221434
Type:
Small organic molecule
Emp. Form.:
C28H27F2NO3
Mol. Mass.:
463.5157
SMILES:
CC(C)(O)CCc1ccc(OCc2cc(-c3cccc(OC(F)F)c3)c3ncccc3c2)cc1
: