Target
cAMP-specific 3',5'-cyclic phosphodiesterase 4D
Ligand
BDBM50325800
Substrate
Meas. Tech.
ChEMBL_652843 (CHEMBL1226046)
IC50
0.900000±n/a nM
Citation
 Aspiotis, RDeschênes, DDubé, DGirard, YHuang, ZLaliberté, FLiu, SPapp, RNicholson, DWYoung, RN The discovery and synthesis of highly potent subtype selective phosphodiesterase 4D inhibitors. Bioorg Med Chem Lett 20:5502-5 (2010)  
Target
Name:
cAMP-specific 3',5'-cyclic phosphodiesterase 4D
Synonyms:
3',5'-cyclic phosphodiesterase PDE43 PDE4D_HUMAN | Phosphodiesterase 4D
Type:
Protein
Mol. Mass.:
91092.69
Organism:
Homo sapiens (Human)
Description:
Q08499
Residue:
809
  
Inhibitor
Name:
BDBM50325800
Synonyms:
3-(4-((8-(3-(difluoromethoxy)phenyl)quinolin-6-yl)methoxy)phenyl)propanenitrile | CHEMBL1223685
Type:
Small organic molecule
Emp. Form.:
C26H20F2N2O2
Mol. Mass.:
430.446
SMILES:
FC(F)Oc1cccc(c1)-c1cc(COc2ccc(CCC#N)cc2)cc2cccnc12
: