Target
cAMP-specific 3',5'-cyclic phosphodiesterase 4D
Ligand
BDBM50325788
Substrate
Meas. Tech.
ChEMBL_652843 (CHEMBL1226046)
IC50
0.200000±n/a nM
Citation
 Aspiotis, RDeschênes, DDubé, DGirard, YHuang, ZLaliberté, FLiu, SPapp, RNicholson, DWYoung, RN The discovery and synthesis of highly potent subtype selective phosphodiesterase 4D inhibitors. Bioorg Med Chem Lett 20:5502-5 (2010)  
Target
Name:
cAMP-specific 3',5'-cyclic phosphodiesterase 4D
Synonyms:
3',5'-cyclic phosphodiesterase PDE43 PDE4D_HUMAN | Phosphodiesterase 4D
Type:
Protein
Mol. Mass.:
91092.69
Organism:
Homo sapiens (Human)
Description:
Q08499
Residue:
809
  
Inhibitor
Name:
BDBM50325788
Synonyms:
2-(4-((8-(3-(difluoromethoxy)phenyl)quinolin-6-yl)methoxy)phenyl)acetic acid | CHEMBL1223687
Type:
Small organic molecule
Emp. Form.:
C25H19F2NO4
Mol. Mass.:
435.4195
SMILES:
OC(=O)Cc1ccc(OCc2cc(-c3cccc(OC(F)F)c3)c3ncccc3c2)cc1
: