Target
cAMP-specific 3',5'-cyclic phosphodiesterase 4A
Ligand
BDBM50325798
Substrate
Meas. Tech.
ChEMBL_652840 (CHEMBL1226043)
IC50
166±n/a nM
Citation
 Aspiotis, RDeschênes, DDubé, DGirard, YHuang, ZLaliberté, FLiu, SPapp, RNicholson, DWYoung, RN The discovery and synthesis of highly potent subtype selective phosphodiesterase 4D inhibitors. Bioorg Med Chem Lett 20:5502-5 (2010)  
Target
Name:
cAMP-specific 3',5'-cyclic phosphodiesterase 4A
Synonyms:
3',5'-cyclic phosphodiesterase PDE46 PDE4A_HUMAN Phosphodiesterase 4A | Phosphodiesterase 4A (PDE4)
Type:
Enzyme
Mol. Mass.:
98113.27
Organism:
Homo sapiens (Human)
Description:
P27815
Residue:
886
  
Inhibitor
Name:
BDBM50325798
Synonyms:
3-(4-((8-(3-ethoxyphenyl)quinolin-6-yl)methoxy)phenyl)propanenitrile | CHEMBL1223621
Type:
Small organic molecule
Emp. Form.:
C27H24N2O2
Mol. Mass.:
408.4917
SMILES:
CCOc1cccc(c1)-c1cc(COc2ccc(CCC#N)cc2)cc2cccnc12
: