Target
cAMP-specific 3',5'-cyclic phosphodiesterase 4B
Ligand
BDBM50174017
Substrate
Meas. Tech.
ChEMBL_652841 (CHEMBL1226044)
IC50
2.3±n/a nM
Citation
 Aspiotis, RDeschênes, DDubé, DGirard, YHuang, ZLaliberté, FLiu, SPapp, RNicholson, DWYoung, RN The discovery and synthesis of highly potent subtype selective phosphodiesterase 4D inhibitors. Bioorg Med Chem Lett 20:5502-5 (2010)  
Target
Name:
cAMP-specific 3',5'-cyclic phosphodiesterase 4B
Synonyms:
3',5'-cyclic phosphodiesterase Isoform PDE4B1 PDE4B PDE4B_HUMAN Phosphodiesterase 4B (PDE4B) Phosphodiesterase Type 4 (PDE4B)
Type:
Protein
Mol. Mass.:
83318.87
Organism:
Homo sapiens (Human)
Description:
Q07343
Residue:
736
  
Inhibitor
Name:
BDBM50174017
Synonyms:
8-(3-(2-(3-methylcyclopenta-1,3-dienyl)-2-(4-(methylsulfonyl)phenyl)vinyl)phenyl)-6-(2-(methylsulfonyl)propan-2-yl)quinoline CHEMBL198432
Type:
Small organic molecule
Emp. Form.:
C22H18N2O
Mol. Mass.:
326.3911
SMILES:
COc1cccc(c1)-c1cc(Cc2ccncc2)cc2cccnc12
: