Target
Mitogen-activated protein kinase 11
Ligand
BDBM13531
Substrate
Meas. Tech.
ChEMBL_660314 (CHEMBL1249810)
IC50
100±n/a nM
Citation
 Davies, SPReddy, HCaivano, MCohen, P Specificity and mechanism of action of some commonly used protein kinase inhibitors. Biochem J 351:95-105 (2001)  
Target
Name:
Mitogen-activated protein kinase 11
Synonyms:
MAP kinase p38 MK11_HUMAN Mitogen-activated protein kinase p38 beta SAPK2 Stress-activated protein kinase 2 p38-2 p38b
Type:
Enzyme Catalytic Domain
Mol. Mass.:
41351.73
Organism:
Homo sapiens (Human)
Description:
gi_20128774
Residue:
364
  
Inhibitor
Name:
BDBM13531
Synonyms:
4-(4-Fluorophenyl)-2-(4-hydroxyphenyl)-5-(4-pyridyl)-1H-imidazole 4-[4-(4-fluorophenyl)-5-(4-pyridyl)-4-imidazolin-2-ylidene]cyclohexa-2,5-dien-1-one SB-202190 biotinylated SB202190
Type:
Small organic molecule
Emp. Form.:
C20H14FN3O
Mol. Mass.:
331.3431
SMILES:
Oc1ccc(cc1)-c1nc(c([nH]1)-c1ccc(F)cc1)-c1ccncc1
: